{"text_format":"1","workbook":"xlsx","n_sheets":3,"sheets":["Model","SCENARIOS","Lists"],"not_rendered":{"charts":0,"images":0,"macros":1,"external_links":0,"defined_names":0,"comments":0,"pivot_tables":0},"unopened":[],"bounds":{"document_bytes":16777216,"sheet_cells":100000,"rows_first":2000,"rows_last":500,"rows_between":2000,"halvings":0,"cell_chars":16384,"cell_head_chars":4096},"cells_cut":0,"cells_raw":0,"read":"whole","date_system":"1900"}

{"sheet":"Model","index":0,"n_rows":47,"n_cols":54,"rows_kept":47,"cut":false,"hidden":false,"merged":[]}
[null,null,null,null,null,null,null,null,null,null,null,null,null,null,null,null,null,null,null,null,null,null,null,{"$f":"MAX($W1:W1)+1","v":1},{"$f":"MAX($W1:X1)+1","v":2},{"$f":"MAX($W1:Y1)+1","v":3},{"$f":"MAX($W1:Z1)+1","v":4},{"$f":"MAX($W1:AA1)+1","v":5},{"$f":"MAX($W1:AB1)+1","v":6},{"$f":"MAX($W1:AC1)+1","v":7},{"$f":"MAX($W1:AD1)+1","v":8},{"$f":"MAX($W1:AE1)+1","v":9},{"$f":"MAX($W1:AF1)+1","v":10},{"$f":"MAX($W1:AG1)+1","v":11},{"$f":"MAX($W1:AH1)+1","v":12},{"$f":"MAX($W1:AI1)+1","v":13},{"$f":"MAX($W1:AJ1)+1","v":14},{"$f":"MAX($W1:AK1)+1","v":15},{"$f":"MAX($W1:AL1)+1","v":16},{"$f":"MAX($W1:AM1)+1","v":17},{"$f":"MAX($W1:AN1)+1","v":18},{"$f":"MAX($W1:AO1)+1","v":19},{"$f":"MAX($W1:AP1)+1","v":20},{"$f":"MAX($W1:AQ1)+1","v":21},{"$f":"MAX($W1:AR1)+1","v":22},{"$f":"MAX($W1:AS1)+1","v":23},{"$f":"MAX($W1:AT1)+1","v":24},{"$f":"MAX($W1:AU1)+1","v":25},{"$f":"MAX($W1:AV1)+1","v":26},{"$f":"MAX($W1:AW1)+1","v":27},{"$f":"MAX($W1:AX1)+1","v":28},{"$f":"MAX($W1:AY1)+1","v":29},{"$f":"MAX($W1:AZ1)+1","v":30},{"$f":"MAX($W1:BA1)+1","v":31}]
[null,null,null,null,null,null,null,null,null,null,null,null,null,null,null,null,null,null,null,null,null,null,null,{"$f":"COLUMN()","v":24},{"$f":"COLUMN()","v":25},{"$f":"COLUMN()","v":26},{"$f":"COLUMN()","v":27},{"$f":"COLUMN()","v":28},{"$f":"COLUMN()","v":29},{"$f":"COLUMN()","v":30},{"$f":"COLUMN()","v":31},{"$f":"COLUMN()","v":32},{"$f":"COLUMN()","v":33},{"$f":"COLUMN()","v":34},{"$f":"COLUMN()","v":35},{"$f":"COLUMN()","v":36},{"$f":"COLUMN()","v":37},{"$f":"COLUMN()","v":38},{"$f":"COLUMN()","v":39},{"$f":"COLUMN()","v":40},{"$f":"COLUMN()","v":41},{"$f":"COLUMN()","v":42},{"$f":"COLUMN()","v":43},{"$f":"COLUMN()","v":44},{"$f":"COLUMN()","v":45},{"$f":"COLUMN()","v":46},{"$f":"COLUMN()","v":47},{"$f":"COLUMN()","v":48},{"$f":"COLUMN()","v":49},{"$f":"COLUMN()","v":50},{"$f":"COLUMN()","v":51},{"$f":"COLUMN()","v":52},{"$f":"COLUMN()","v":53},{"$f":"COLUMN()","v":54}]
[]
[null,null,null,null,null,null,null,{"$f":"Lists!$S$6","v":"показатель"},null,null,null,null,{"$f":"Lists!$S$7","v":"ед.изм."},null,null,{"$f":"Lists!$S$8","v":"значение"},null,null,null,null,{"$f":"Lists!$S$9","v":"итого"},null,null,{"$f":"IF(OR($P$6=\"\",$P$6=0,$P$7=\"\",$P$7=0,$P$8=\"\",$P$7<1),\"\",\nIF(X$8=\"\",\"\",\nIF($P$6=Lists!$I$6,X6,\nIF($P$6=Lists!$I$7,INT(MONTH(X7)/3)&\"кв\"&(YEAR(X7)-2000)&\"г\",\nIF($P$6=Lists!$I$8,X8&\" год\",\nIF($P$6=Lists!$I$9,YEAR(X7)&\"г.\",\"\"))))))","v":"2021-12-01"},{"$f":"IF(OR($P$6=\"\",$P$6=0,$P$7=\"\",$P$7=0,$P$8=\"\",$P$7<1),\"\",\nIF(Y$8=\"\",\"\",\nIF($P$6=Lists!$I$6,Y6,\nIF($P$6=Lists!$I$7,INT(MONTH(Y7)/3)&\"кв\"&(YEAR(Y7)-2000)&\"г\",\nIF($P$6=Lists!$I$8,Y8&\" год\",\nIF($P$6=Lists!$I$9,YEAR(Y7)&\"г.\",\"\"))))))","v":"2022-01-01"},{"$f":"IF(OR($P$6=\"\",$P$6=0,$P$7=\"\",$P$7=0,$P$8=\"\",$P$7<1),\"\",\nIF(Z$8=\"\",\"\",\nIF($P$6=Lists!$I$6,Z6,\nIF($P$6=Lists!$I$7,INT(MONTH(Z7)/3)&\"кв\"&(YEAR(Z7)-2000)&\"г\",\nIF($P$6=Lists!$I$8,Z8&\" год\",\nIF($P$6=Lists!$I$9,YEAR(Z7)&\"г.\",\"\"))))))","v":"2022-02-01"},{"$f":"IF(OR($P$6=\"\",$P$6=0,$P$7=\"\",$P$7=0,$P$8=\"\",$P$7<1),\"\",\nIF(AA$8=\"\",\"\",\nIF($P$6=Lists!$I$6,AA6,\nIF($P$6=Lists!$I$7,INT(MONTH(AA7)/3)&\"кв\"&(YEAR(AA7)-2000)&\"г\",\nIF($P$6=Lists!$I$8,AA8&\" год\",\nIF($P$6=Lists!$I$9,YEAR(AA7)&\"г.\",\"\"))))))","v":"2022-03-01"},{"$f":"IF(OR($P$6=\"\",$P$6=0,$P$7=\"\",$P$7=0,$P$8=\"\",$P$7<1),\"\",\nIF(AB$8=\"\",\"\",\nIF($P$6=Lists!$I$6,AB6,\nIF($P$6=Lists!$I$7,INT(MONTH(AB7)/3)&\"кв\"&(YEAR(AB7)-2000)&\"г\",\nIF($P$6=Lists!$I$8,AB8&\" год\",\nIF($P$6=Lists!$I$9,YEAR(AB7)&\"г.\",\"\"))))))","v":"2022-04-01"},{"$f":"IF(OR($P$6=\"\",$P$6=0,$P$7=\"\",$P$7=0,$P$8=\"\",$P$7<1),\"\",\nIF(AC$8=\"\",\"\",\nIF($P$6=Lists!$I$6,AC6,\nIF($P$6=Lists!$I$7,INT(MONTH(AC7)/3)&\"кв\"&(YEAR(AC7)-2000)&\"г\",\nIF($P$6=Lists!$I$8,AC8&\" год\",\nIF($P$6=Lists!$I$9,YEAR(AC7)&\"г.\",\"\"))))))","v":"2022-05-01"},{"$f":"IF(OR($P$6=\"\",$P$6=0,$P$7=\"\",$P$7=0,$P$8=\"\",$P$7<1),\"\",\nIF(AD$8=\"\",\"\",\nIF($P$6=Lists!$I$6,AD6,\nIF($P$6=Lists!$I$7,INT(MONTH(AD7)/3)&\"кв\"&(YEAR(AD7)-2000)&\"г\",\nIF($P$6=Lists!$I$8,AD8&\" год\",\nIF($P$6=Lists!$I$9,YEAR(AD7)&\"г.\",\"\"))))))","v":"2022-06-01"},{"$f":"IF(OR($P$6=\"\",$P$6=0,$P$7=\"\",$P$7=0,$P$8=\"\",$P$7<1),\"\",\nIF(AE$8=\"\",\"\",\nIF($P$6=Lists!$I$6,AE6,\nIF($P$6=Lists!$I$7,INT(MONTH(AE7)/3)&\"кв\"&(YEAR(AE7)-2000)&\"г\",\nIF($P$6=Lists!$I$8,AE8&\" год\",\nIF($P$6=Lists!$I$9,YEAR(AE7)&\"г.\",\"\"))))))","v":"2022-07-01"},{"$f":"IF(OR($P$6=\"\",$P$6=0,$P$7=\"\",$P$7=0,$P$8=\"\",$P$7<1),\"\",\nIF(AF$8=\"\",\"\",\nIF($P$6=Lists!$I$6,AF6,\nIF($P$6=Lists!$I$7,INT(MONTH(AF7)/3)&\"кв\"&(YEAR(AF7)-2000)&\"г\",\nIF($P$6=Lists!$I$8,AF8&\" год\",\nIF($P$6=Lists!$I$9,YEAR(AF7)&\"г.\",\"\"))))))","v":"2022-08-01"},{"$f":"IF(OR($P$6=\"\",$P$6=0,$P$7=\"\",$P$7=0,$P$8=\"\",$P$7<1),\"\",\nIF(AG$8=\"\",\"\",\nIF($P$6=Lists!$I$6,AG6,\nIF($P$6=Lists!$I$7,INT(MONTH(AG7)/3)&\"кв\"&(YEAR(AG7)-2000)&\"г\",\nIF($P$6=Lists!$I$8,AG8&\" год\",\nIF($P$6=Lists!$I$9,YEAR(AG7)&\"г.\",\"\"))))))","v":"2022-09-01"},{"$f":"IF(OR($P$6=\"\",$P$6=0,$P$7=\"\",$P$7=0,$P$8=\"\",$P$7<1),\"\",\nIF(AH$8=\"\",\"\",\nIF($P$6=Lists!$I$6,AH6,\nIF($P$6=Lists!$I$7,INT(MONTH(AH7)/3)&\"кв\"&(YEAR(AH7)-2000)&\"г\",\nIF($P$6=Lists!$I$8,AH8&\" год\",\nIF($P$6=Lists!$I$9,YEAR(AH7)&\"г.\",\"\"))))))","v":"2022-10-01"},{"$f":"IF(OR($P$6=\"\",$P$6=0,$P$7=\"\",$P$7=0,$P$8=\"\",$P$7<1),\"\",\nIF(AI$8=\"\",\"\",\nIF($P$6=Lists!$I$6,AI6,\nIF($P$6=Lists!$I$7,INT(MONTH(AI7)/3)&\"кв\"&(YEAR(AI7)-2000)&\"г\",\nIF($P$6=Lists!$I$8,AI8&\" год\",\nIF($P$6=Lists!$I$9,YEAR(AI7)&\"г.\",\"\"))))))","v":"2022-11-01"},{"$f":"IF(OR($P$6=\"\",$P$6=0,$P$7=\"\",$P$7=0,$P$8=\"\",$P$7<1),\"\",\nIF(AJ$8=\"\",\"\",\nIF($P$6=Lists!$I$6,AJ6,\nIF($P$6=Lists!$I$7,INT(MONTH(AJ7)/3)&\"кв\"&(YEAR(AJ7)-2000)&\"г\",\nIF($P$6=Lists!$I$8,AJ8&\" год\",\nIF($P$6=Lists!$I$9,YEAR(AJ7)&\"г.\",\"\"))))))","v":"2022-12-01"},{"$f":"IF(OR($P$6=\"\",$P$6=0,$P$7=\"\",$P$7=0,$P$8=\"\",$P$7<1),\"\",\nIF(AK$8=\"\",\"\",\nIF($P$6=Lists!$I$6,AK6,\nIF($P$6=Lists!$I$7,INT(MONTH(AK7)/3)&\"кв\"&(YEAR(AK7)-2000)&\"г\",\nIF($P$6=Lists!$I$8,AK8&\" год\",\nIF($P$6=Lists!$I$9,YEAR(AK7)&\"г.\",\"\"))))))","v":"2023-01-01"},{"$f":"IF(OR($P$6=\"\",$P$6=0,$P$7=\"\",$P$7=0,$P$8=\"\",$P$7<1),\"\",\nIF(AL$8=\"\",\"\",\nIF($P$6=Lists!$I$6,AL6,\nIF($P$6=Lists!$I$7,INT(MONTH(AL7)/3)&\"кв\"&(YEAR(AL7)-2000)&\"г\",\nIF($P$6=Lists!$I$8,AL8&\" год\",\nIF($P$6=Lists!$I$9,YEAR(AL7)&\"г.\",\"\"))))))","v":"2023-02-01"},{"$f":"IF(OR($P$6=\"\",$P$6=0,$P$7=\"\",$P$7=0,$P$8=\"\",$P$7<1),\"\",\nIF(AM$8=\"\",\"\",\nIF($P$6=Lists!$I$6,AM6,\nIF($P$6=Lists!$I$7,INT(MONTH(AM7)/3)&\"кв\"&(YEAR(AM7)-2000)&\"г\",\nIF($P$6=Lists!$I$8,AM8&\" год\",\nIF($P$6=Lists!$I$9,YEAR(AM7)&\"г.\",\"\"))))))","v":"2023-03-01"},{"$f":"IF(OR($P$6=\"\",$P$6=0,$P$7=\"\",$P$7=0,$P$8=\"\",$P$7<1),\"\",\nIF(AN$8=\"\",\"\",\nIF($P$6=Lists!$I$6,AN6,\nIF($P$6=Lists!$I$7,INT(MONTH(AN7)/3)&\"кв\"&(YEAR(AN7)-2000)&\"г\",\nIF($P$6=Lists!$I$8,AN8&\" год\",\nIF($P$6=Lists!$I$9,YEAR(AN7)&\"г.\",\"\"))))))","v":"2023-04-01"},{"$f":"IF(OR($P$6=\"\",$P$6=0,$P$7=\"\",$P$7=0,$P$8=\"\",$P$7<1),\"\",\nIF(AO$8=\"\",\"\",\nIF($P$6=Lists!$I$6,AO6,\nIF($P$6=Lists!$I$7,INT(MONTH(AO7)/3)&\"кв\"&(YEAR(AO7)-2000)&\"г\",\nIF($P$6=Lists!$I$8,AO8&\" год\",\nIF($P$6=Lists!$I$9,YEAR(AO7)&\"г.\",\"\"))))))","v":"2023-05-01"},{"$f":"IF(OR($P$6=\"\",$P$6=0,$P$7=\"\",$P$7=0,$P$8=\"\",$P$7<1),\"\",\nIF(AP$8=\"\",\"\",\nIF($P$6=Lists!$I$6,AP6,\nIF($P$6=Lists!$I$7,INT(MONTH(AP7)/3)&\"кв\"&(YEAR(AP7)-2000)&\"г\",\nIF($P$6=Lists!$I$8,AP8&\" год\",\nIF($P$6=Lists!$I$9,YEAR(AP7)&\"г.\",\"\"))))))","v":"2023-06-01"},{"$f":"IF(OR($P$6=\"\",$P$6=0,$P$7=\"\",$P$7=0,$P$8=\"\",$P$7<1),\"\",\nIF(AQ$8=\"\",\"\",\nIF($P$6=Lists!$I$6,AQ6,\nIF($P$6=Lists!$I$7,INT(MONTH(AQ7)/3)&\"кв\"&(YEAR(AQ7)-2000)&\"г\",\nIF($P$6=Lists!$I$8,AQ8&\" год\",\nIF($P$6=Lists!$I$9,YEAR(AQ7)&\"г.\",\"\"))))))","v":"2023-07-01"},{"$f":"IF(OR($P$6=\"\",$P$6=0,$P$7=\"\",$P$7=0,$P$8=\"\",$P$7<1),\"\",\nIF(AR$8=\"\",\"\",\nIF($P$6=Lists!$I$6,AR6,\nIF($P$6=Lists!$I$7,INT(MONTH(AR7)/3)&\"кв\"&(YEAR(AR7)-2000)&\"г\",\nIF($P$6=Lists!$I$8,AR8&\" год\",\nIF($P$6=Lists!$I$9,YEAR(AR7)&\"г.\",\"\"))))))","v":"2023-08-01"},{"$f":"IF(OR($P$6=\"\",$P$6=0,$P$7=\"\",$P$7=0,$P$8=\"\",$P$7<1),\"\",\nIF(AS$8=\"\",\"\",\nIF($P$6=Lists!$I$6,AS6,\nIF($P$6=Lists!$I$7,INT(MONTH(AS7)/3)&\"кв\"&(YEAR(AS7)-2000)&\"г\",\nIF($P$6=Lists!$I$8,AS8&\" год\",\nIF($P$6=Lists!$I$9,YEAR(AS7)&\"г.\",\"\"))))))","v":"2023-09-01"},{"$f":"IF(OR($P$6=\"\",$P$6=0,$P$7=\"\",$P$7=0,$P$8=\"\",$P$7<1),\"\",\nIF(AT$8=\"\",\"\",\nIF($P$6=Lists!$I$6,AT6,\nIF($P$6=Lists!$I$7,INT(MONTH(AT7)/3)&\"кв\"&(YEAR(AT7)-2000)&\"г\",\nIF($P$6=Lists!$I$8,AT8&\" год\",\nIF($P$6=Lists!$I$9,YEAR(AT7)&\"г.\",\"\"))))))","v":"2023-10-01"},{"$f":"IF(OR($P$6=\"\",$P$6=0,$P$7=\"\",$P$7=0,$P$8=\"\",$P$7<1),\"\",\nIF(AU$8=\"\",\"\",\nIF($P$6=Lists!$I$6,AU6,\nIF($P$6=Lists!$I$7,INT(MONTH(AU7)/3)&\"кв\"&(YEAR(AU7)-2000)&\"г\",\nIF($P$6=Lists!$I$8,AU8&\" год\",\nIF($P$6=Lists!$I$9,YEAR(AU7)&\"г.\",\"\"))))))","v":"2023-11-01"},{"$f":"IF(OR($P$6=\"\",$P$6=0,$P$7=\"\",$P$7=0,$P$8=\"\",$P$7<1),\"\",\nIF(AV$8=\"\",\"\",\nIF($P$6=Lists!$I$6,AV6,\nIF($P$6=Lists!$I$7,INT(MONTH(AV7)/3)&\"кв\"&(YEAR(AV7)-2000)&\"г\",\nIF($P$6=Lists!$I$8,AV8&\" год\",\nIF($P$6=Lists!$I$9,YEAR(AV7)&\"г.\",\"\"))))))","v":""},{"$f":"IF(OR($P$6=\"\",$P$6=0,$P$7=\"\",$P$7=0,$P$8=\"\",$P$7<1),\"\",\nIF(AW$8=\"\",\"\",\nIF($P$6=Lists!$I$6,AW6,\nIF($P$6=Lists!$I$7,INT(MONTH(AW7)/3)&\"кв\"&(YEAR(AW7)-2000)&\"г\",\nIF($P$6=Lists!$I$8,AW8&\" год\",\nIF($P$6=Lists!$I$9,YEAR(AW7)&\"г.\",\"\"))))))","v":""},{"$f":"IF(OR($P$6=\"\",$P$6=0,$P$7=\"\",$P$7=0,$P$8=\"\",$P$7<1),\"\",\nIF(AX$8=\"\",\"\",\nIF($P$6=Lists!$I$6,AX6,\nIF($P$6=Lists!$I$7,INT(MONTH(AX7)/3)&\"кв\"&(YEAR(AX7)-2000)&\"г\",\nIF($P$6=Lists!$I$8,AX8&\" год\",\nIF($P$6=Lists!$I$9,YEAR(AX7)&\"г.\",\"\"))))))","v":""},{"$f":"IF(OR($P$6=\"\",$P$6=0,$P$7=\"\",$P$7=0,$P$8=\"\",$P$7<1),\"\",\nIF(AY$8=\"\",\"\",\nIF($P$6=Lists!$I$6,AY6,\nIF($P$6=Lists!$I$7,INT(MONTH(AY7)/3)&\"кв\"&(YEAR(AY7)-2000)&\"г\",\nIF($P$6=Lists!$I$8,AY8&\" год\",\nIF($P$6=Lists!$I$9,YEAR(AY7)&\"г.\",\"\"))))))","v":""},{"$f":"IF(OR($P$6=\"\",$P$6=0,$P$7=\"\",$P$7=0,$P$8=\"\",$P$7<1),\"\",\nIF(AZ$8=\"\",\"\",\nIF($P$6=Lists!$I$6,AZ6,\nIF($P$6=Lists!$I$7,INT(MONTH(AZ7)/3)&\"кв\"&(YEAR(AZ7)-2000)&\"г\",\nIF($P$6=Lists!$I$8,AZ8&\" год\",\nIF($P$6=Lists!$I$9,YEAR(AZ7)&\"г.\",\"\"))))))","v":""},{"$f":"IF(OR($P$6=\"\",$P$6=0,$P$7=\"\",$P$7=0,$P$8=\"\",$P$7<1),\"\",\nIF(BA$8=\"\",\"\",\nIF($P$6=Lists!$I$6,BA6,\nIF($P$6=Lists!$I$7,INT(MONTH(BA7)/3)&\"кв\"&(YEAR(BA7)-2000)&\"г\",\nIF($P$6=Lists!$I$8,BA8&\" год\",\nIF($P$6=Lists!$I$9,YEAR(BA7)&\"г.\",\"\"))))))","v":""},{"$f":"IF(OR($P$6=\"\",$P$6=0,$P$7=\"\",$P$7=0,$P$8=\"\",$P$7<1),\"\",\nIF(BB$8=\"\",\"\",\nIF($P$6=Lists!$I$6,BB6,\nIF($P$6=Lists!$I$7,INT(MONTH(BB7)/3)&\"кв\"&(YEAR(BB7)-2000)&\"г\",\nIF($P$6=Lists!$I$8,BB8&\" год\",\nIF($P$6=Lists!$I$9,YEAR(BB7)&\"г.\",\"\"))))))","v":""}]
[]
[null,{"$f":"ROW()","v":6},null,null,{"$f":"IF(E4=1,\"ENG\",\"РУС\")","v":"РУС"},null,null,{"$f":"I6","v":"минимальный период расчетов"},{"$f":"Lists!$I$4","v":"минимальный период расчетов"},null,null,null,"тип периода",null,"*","месяц","^",null,null,null,{"$f":"X6","v":"2021-12-01"},null,null,{"$f":"IF(OR($P$6=\"\",$P$6=0,$P$7=\"\",$P$7=0,$P$8=\"\",$P$7<1),\"\",\nIF(X$8=\"\",\"\",\nIF(X$8=1,EOMONTH($P$7,-1)+1,W7+1)))","v":"2021-12-01"},{"$f":"IF(OR($P$6=\"\",$P$6=0,$P$7=\"\",$P$7=0,$P$8=\"\",$P$7<1),\"\",\nIF(Y$8=\"\",\"\",\nIF(Y$8=1,EOMONTH($P$7,-1)+1,X7+1)))","v":"2022-01-01"},"2022-02-01","2022-03-01","2022-04-01","2022-05-01","2022-06-01",{"$f":"IF(OR($P$6=\"\",$P$6=0,$P$7=\"\",$P$7=0,$P$8=\"\",$P$7<1),\"\",\nIF(AE$8=\"\",\"\",\nIF(AE$8=1,EOMONTH($P$7,-1)+1,AD7+1)))","v":"2022-07-01"},{"$f":"IF(OR($P$6=\"\",$P$6=0,$P$7=\"\",$P$7=0,$P$8=\"\",$P$7<1),\"\",\nIF(AF$8=\"\",\"\",\nIF(AF$8=1,EOMONTH($P$7,-1)+1,AE7+1)))","v":"2022-08-01"},{"$f":"IF(OR($P$6=\"\",$P$6=0,$P$7=\"\",$P$7=0,$P$8=\"\",$P$7<1),\"\",\nIF(AG$8=\"\",\"\",\nIF(AG$8=1,EOMONTH($P$7,-1)+1,AF7+1)))","v":"2022-09-01"},{"$f":"IF(OR($P$6=\"\",$P$6=0,$P$7=\"\",$P$7=0,$P$8=\"\",$P$7<1),\"\",\nIF(AH$8=\"\",\"\",\nIF(AH$8=1,EOMONTH($P$7,-1)+1,AG7+1)))","v":"2022-10-01"},{"$f":"IF(OR($P$6=\"\",$P$6=0,$P$7=\"\",$P$7=0,$P$8=\"\",$P$7<1),\"\",\nIF(AI$8=\"\",\"\",\nIF(AI$8=1,EOMONTH($P$7,-1)+1,AH7+1)))","v":"2022-11-01"},{"$f":"IF(OR($P$6=\"\",$P$6=0,$P$7=\"\",$P$7=0,$P$8=\"\",$P$7<1),\"\",\nIF(AJ$8=\"\",\"\",\nIF(AJ$8=1,EOMONTH($P$7,-1)+1,AI7+1)))","v":"2022-12-01"},{"$f":"IF(OR($P$6=\"\",$P$6=0,$P$7=\"\",$P$7=0,$P$8=\"\",$P$7<1),\"\",\nIF(AK$8=\"\",\"\",\nIF(AK$8=1,EOMONTH($P$7,-1)+1,AJ7+1)))","v":"2023-01-01"},{"$f":"IF(OR($P$6=\"\",$P$6=0,$P$7=\"\",$P$7=0,$P$8=\"\",$P$7<1),\"\",\nIF(AL$8=\"\",\"\",\nIF(AL$8=1,EOMONTH($P$7,-1)+1,AK7+1)))","v":"2023-02-01"},{"$f":"IF(OR($P$6=\"\",$P$6=0,$P$7=\"\",$P$7=0,$P$8=\"\",$P$7<1),\"\",\nIF(AM$8=\"\",\"\",\nIF(AM$8=1,EOMONTH($P$7,-1)+1,AL7+1)))","v":"2023-03-01"},{"$f":"IF(OR($P$6=\"\",$P$6=0,$P$7=\"\",$P$7=0,$P$8=\"\",$P$7<1),\"\",\nIF(AN$8=\"\",\"\",\nIF(AN$8=1,EOMONTH($P$7,-1)+1,AM7+1)))","v":"2023-04-01"},{"$f":"IF(OR($P$6=\"\",$P$6=0,$P$7=\"\",$P$7=0,$P$8=\"\",$P$7<1),\"\",\nIF(AO$8=\"\",\"\",\nIF(AO$8=1,EOMONTH($P$7,-1)+1,AN7+1)))","v":"2023-05-01"},{"$f":"IF(OR($P$6=\"\",$P$6=0,$P$7=\"\",$P$7=0,$P$8=\"\",$P$7<1),\"\",\nIF(AP$8=\"\",\"\",\nIF(AP$8=1,EOMONTH($P$7,-1)+1,AO7+1)))","v":"2023-06-01"},{"$f":"IF(OR($P$6=\"\",$P$6=0,$P$7=\"\",$P$7=0,$P$8=\"\",$P$7<1),\"\",\nIF(AQ$8=\"\",\"\",\nIF(AQ$8=1,EOMONTH($P$7,-1)+1,AP7+1)))","v":"2023-07-01"},{"$f":"IF(OR($P$6=\"\",$P$6=0,$P$7=\"\",$P$7=0,$P$8=\"\",$P$7<1),\"\",\nIF(AR$8=\"\",\"\",\nIF(AR$8=1,EOMONTH($P$7,-1)+1,AQ7+1)))","v":"2023-08-01"},{"$f":"IF(OR($P$6=\"\",$P$6=0,$P$7=\"\",$P$7=0,$P$8=\"\",$P$7<1),\"\",\nIF(AS$8=\"\",\"\",\nIF(AS$8=1,EOMONTH($P$7,-1)+1,AR7+1)))","v":"2023-09-01"},{"$f":"IF(OR($P$6=\"\",$P$6=0,$P$7=\"\",$P$7=0,$P$8=\"\",$P$7<1),\"\",\nIF(AT$8=\"\",\"\",\nIF(AT$8=1,EOMONTH($P$7,-1)+1,AS7+1)))","v":"2023-10-01"},{"$f":"IF(OR($P$6=\"\",$P$6=0,$P$7=\"\",$P$7=0,$P$8=\"\",$P$7<1),\"\",\nIF(AU$8=\"\",\"\",\nIF(AU$8=1,EOMONTH($P$7,-1)+1,AT7+1)))","v":"2023-11-01"},{"$f":"IF(OR($P$6=\"\",$P$6=0,$P$7=\"\",$P$7=0,$P$8=\"\",$P$7<1),\"\",\nIF(AV$8=\"\",\"\",\nIF(AV$8=1,EOMONTH($P$7,-1)+1,AU7+1)))","v":""},{"$f":"IF(OR($P$6=\"\",$P$6=0,$P$7=\"\",$P$7=0,$P$8=\"\",$P$7<1),\"\",\nIF(AW$8=\"\",\"\",\nIF(AW$8=1,EOMONTH($P$7,-1)+1,AV7+1)))","v":""},{"$f":"IF(OR($P$6=\"\",$P$6=0,$P$7=\"\",$P$7=0,$P$8=\"\",$P$7<1),\"\",\nIF(AX$8=\"\",\"\",\nIF(AX$8=1,EOMONTH($P$7,-1)+1,AW7+1)))","v":""},{"$f":"IF(OR($P$6=\"\",$P$6=0,$P$7=\"\",$P$7=0,$P$8=\"\",$P$7<1),\"\",\nIF(AY$8=\"\",\"\",\nIF(AY$8=1,EOMONTH($P$7,-1)+1,AX7+1)))","v":""},{"$f":"IF(OR($P$6=\"\",$P$6=0,$P$7=\"\",$P$7=0,$P$8=\"\",$P$7<1),\"\",\nIF(AZ$8=\"\",\"\",\nIF(AZ$8=1,EOMONTH($P$7,-1)+1,AY7+1)))","v":""},{"$f":"IF(OR($P$6=\"\",$P$6=0,$P$7=\"\",$P$7=0,$P$8=\"\",$P$7<1),\"\",\nIF(BA$8=\"\",\"\",\nIF(BA$8=1,EOMONTH($P$7,-1)+1,AZ7+1)))","v":""},{"$f":"IF(OR($P$6=\"\",$P$6=0,$P$7=\"\",$P$7=0,$P$8=\"\",$P$7<1),\"\",\nIF(BB$8=\"\",\"\",\nIF(BB$8=1,EOMONTH($P$7,-1)+1,BA7+1)))","v":""}]
{"$rows_left_out":42}
{"sheet":"SCENARIOS","index":1,"n_rows":13,"n_cols":6,"rows_kept":13,"cut":false,"hidden":false,"merged":[]}
[]
[]
[]
[null,"№","параметр (вводные данные)",null,"сценарии:","текущий сценарий"]
[null,1,{"$f":"Model!I12","v":"размер дохода в начальный период"},null,null,{"$f":"Model!$P$12","v":100000}]
[null,2,{"$f":"Model!I13","v":"прирост дохода период-к-периоду"},null,null,{"$f":"Model!$P$13","v":50000}]
{"$rows_left_out":8}
{"sheet":"Lists","index":2,"n_rows":47,"n_cols":29,"rows_kept":47,"cut":false,"hidden":false,"merged":[]}
[null,null,null,null,null,null,null,null,{"$f":"COLUMN()","v":9},null,null,null,null,{"$f":"COLUMN()","v":14},null,null,null,null,{"$f":"COLUMN()","v":19},null,null,null,{"$f":"COLUMN()","v":23},null,null,null,{"$f":"COLUMN()","v":27}]
[null,null,null,null,null,null,null,null,{"$f":"LEFT(ADDRESS(1,I1,4),(LEN(ADDRESS(1,I1,4))-1))","v":"I"},null,null,null,null,{"$f":"LEFT(ADDRESS(1,N1,4),(LEN(ADDRESS(1,N1,4))-1))","v":"N"},null,null,null,null,{"$f":"LEFT(ADDRESS(1,S1,4),(LEN(ADDRESS(1,S1,4))-1))","v":"S"},null,null,null,{"$f":"LEFT(ADDRESS(1,W1,4),(LEN(ADDRESS(1,W1,4))-1))","v":"W"},null,null,null,{"$f":"LEFT(ADDRESS(1,AA1,4),(LEN(ADDRESS(1,AA1,4))-1))","v":"AA"}]
[]
[null,null,null,null,null,null,null,null,{"$f":"$S$26","v":"минимальный период расчетов"},null,null,null,null,{"$f":"$S$27","v":"старт моделирования"},null,null,null,null,"названия",null,null,null,"названия на русском",null,null,null,"названия на английском"]
[{"$f":"ROW()","v":5},null,null,null,null,null,null,null,{"$f":"\"Lists!\"&I$2&$A6&\":\"&I$2&($A5+MAX(J:J))","v":"Lists!I6:I9"},null,null,null,null,{"$f":"\"Lists!\"&N$2&$A6&\":\"&N$2&($A5+MAX(O:O))","v":"Lists!N6:N29"},null,null,null,null,{"$f":"\"Lists!\"&S$2&$A6&\":\"&S$2&($A5+MAX(T:T))","v":"Lists!S6:S27"},null,null,null,{"$f":"\"Lists!\"&W$2&$A6&\":\"&W$2&($A5+MAX(X:X))","v":"Lists!W6:W27"},null,null,null,{"$f":"\"Lists!\"&AA$2&$A6&\":\"&AA$2&($A5+MAX(AB:AB))","v":"Lists!AA6:AA27"}]
[{"$f":"ROW()","v":6},null,null,null,null,null,null,"*","месяц",{"$f":"MAX(J$5:J5)+1","v":1},{"$f":"IF(AND(I6=\"\",J6<>0),1,IF(COUNTIF(I:I,I6)<>1,1,0))","v":0},null,"*",{"$f":"EOMONTH(TODAY(),0)+1","v":"2022-01-01"},{"$f":"MAX(O$5:O5)+1","v":1},{"$f":"IF(AND(N6=\"\",O6<>0),1,IF(COUNTIF(N:N,N6)<>1,1,0))","v":0},null,null,{"$f":"IF(Model!$E$4=1,Lists!$AA6,Lists!$W6)","v":"показатель"},{"$f":"MAX(T$5:T5)+1","v":1},{"$f":"IF(AND(S6=\"\",T6<>0),1,IF(COUNTIF(S:S,S6)<>1,1,0))","v":0},"*","показатель",{"$f":"MAX(X$5:X5)+1","v":1},{"$f":"IF(AND(W6=\"\",X6<>0),1,IF(COUNTIF(W:W,W6)<>1,1,0))","v":0},"*","indicator",{"$f":"MAX(AB$5:AB5)+1","v":1},{"$f":"IF(AND(AA6=\"\",AB6<>0),1,IF(COUNTIF(AA:AA,AA6)<>1,1,0))","v":0}]
{"$rows_left_out":41}